ZenHAX

Free Game Research Forum | Official QuickBMS support | twitter @zenhax | SSL HTTPS://zenhax.com
It is currently Tue Sep 26, 2017 6:16 pm

All times are UTC




Post new topic  Reply to topic  [ 11 posts ] 
Author Message
PostPosted: Thu May 04, 2017 4:24 pm 

Joined: Wed May 03, 2017 7:31 pm
Posts: 19
Hello everyone! This tool works fantastic on my windows machines. I tried to setup on opensuse but cant get it to build using "make". I also tried installing .rpm files I found on the web (not for leap) with no success. I followed the directions and think I have all dependencies installed, just not that great with Linux yet, any and all help much appreciated.... Thanks

If i didnt mention, I have the latest opensuse leap....


Top
   
PostPosted: Fri May 05, 2017 9:11 am 

Joined: Wed May 03, 2017 7:31 pm
Posts: 19
How to build on latest opensuse leap? anyone? thx


Top
   
PostPosted: Fri May 05, 2017 9:28 am 
Site Admin
User avatar

Joined: Wed Jul 30, 2014 9:32 pm
Posts: 6722
What's the output of "make"?
You should see various information and errors.


Top
   
PostPosted: Fri May 05, 2017 11:27 am 

Joined: Wed May 03, 2017 7:31 pm
Posts: 19
aluigi wrote:
What's the output of "make"?
You should see various information and errors.


cc quickbms.c -m32 -s -O0 -fstack-protector-all -fno-unit-at-a-time -fno-omit-frame-pointer -w -o quickbms \
\
-D_7ZIP_ST \
\
compression/*.c* encryption/*.c* extra/mem2mem.c libs/lzma/LzmaDec.c libs/lzma/Lzma2Dec.c libs/lzma/Bra86.c libs/lzma/LzFind.c libs/lzma/LzmaEnc.c libs/lzma/Lzma2Enc.c libs/mspack/*.c libs/ppmd/*.cpp libs/aplib/depacks.c libs/brieflz/depacks.c libs/brieflz/brieflz.c compression/jcalg1_static.lib libs/zziplib/*.c libs/bcl/*.c libs/szip/*.c libs/lzhl/*.cpp libs/tdcb/*.c libs/libkirk/*.c libs/7z_advancecomp/*.cc libs/iris/*.cpp libs/old_cabextract/lzx.c libs/mrci/*.cpp libs/lz4/*.c libs/snappy/snappy.cc libs/snappy/snappy-c.cc libs/snappy/snappy-stubs-internal.cc libs/snappy/snappy-sinksource.cc libs/mmini/mmini_huffman.c libs/mmini/mmini_lzl.c libs/clzw/lzw-dec.c libs/clzw/lzw-enc.c libs/lzlib/lzlib.c libs/blosc/blosclz.c libs/gipfeli/*.cc libs/liblzg/src/lib/decode.c libs/liblzg/src/lib/encode.c libs/liblzg/src/lib/checksum.c libs/doboz/*.cpp libs/amiga/* libs/sphlib/c/*.c libs/shadowforce/*.cpp libs/zstd/common/*.c libs/zstd/compress/*.c libs/zstd/decompress/*.c libs/zstd/dictBuilder/*.c libs/zstd/legacy/*.c -Ilibs/zstd -Ilibs/zstd/common -Ilibs/zstd/legacy libs/azo/unAZO.cpp libs/azo/Decoder/MainCodeD.cpp libs/azo/Common/x86Filter.cpp libs/nintendo_ds/*.c libs/ctw/*.c libs/grzip/libgrzip.c libs/heatshrink/heatshrink_decoder.c libs/heatshrink/heatshrink_encoder.c libs/libzling/*.cpp -Ilibs/ecrypt/include -Ilibs/libcsc -D_7Z_TYPES_ libs/libcsc/csc_dec.cpp libs/libcsc/csc_default_alloc.cpp libs/libcsc/csc_filters.cpp libs/libcsc/csc_memio.cpp -DDENSITY_FORCE_INLINE=inline -Drestrict=__restrict__ libs/density/src/*.c libs/density/src/spookyhash/src/*.c libs/brotli/dec/*.c libs/brotli/common/*.c libs/libbsc/adler32/adler32.cpp libs/libbsc/bwt/bwt.cpp libs/libbsc/coder/coder.cpp libs/libbsc/coder/qlfc/qlfc.cpp libs/libbsc/coder/qlfc/qlfc_model.cpp libs/libbsc/filters/detectors.cpp libs/libbsc/filters/preprocessing.cpp libs/libbsc/libbsc/libbsc.cpp libs/libbsc/lzp/lzp.cpp libs/libbsc/platform/platform.cpp libs/libbsc/st/st.cpp libs/shoco/shoco.c libs/ms-compress/src/*.cpp libs/lzjody/lzjody.c libs/lzjody/byteplane_xfrm.c disasm/disasm.c disasm/cmdlist.c disasm/assembl/assembl.c libs/mydownlib/mydownlib.c libs/TurboRLE/trlec.c libs/TurboRLE/trled.c libs/TurboRLE/ext/mrle.c libs/lhasa/lib/*_decoder.c libs/lhasa/lib/crc16.c libs/dipperstein/*.c libs/liblzf/lzf_d.c libs/liblzf/lzf_c_best.c libs/zopfli/*.c libs/lzham_codec/lzhamcomp/*.cpp libs/lzham_codec/lzhamdecomp/*.cpp libs/lzham_codec/lzhamlib/*.cpp -Ilibs/lzham_codec/include -Ilibs/lzham_codec/lzhamcomp -Ilibs/lzham_codec/lzhamdecomp -DLZHAM_ANSI_CPLUSPLUS libs/dmsdos/*.c libs/tornado/Tornado.cpp libs/tornado/Common.cpp libs/PKLib/*.c extra/mybits.c libs/lz5/lz5*.c libs/lizard/*.c libs/ppmz2/*.c* libs/libdivsufsort/*.c libs/xxhash/*.c extra/xalloc.c libs/lzfse/src/*.c libs/hsel/myhsel.cpp libs/hsel/HSEL.cpp libs/glza/GLZAmodel.c libs/minilzo/minilzo.c \
\
-lstdc++ -ldl -lcrypto -lssl -lz -lbz2 -lstdc++ -lm -lpthread -llzo2 -DDISABLE_UCL -DDISABLE_MCRYPT -DDISABLE_TOMCRYPT
/bin/sh: cc: command not found
Makefile:25: recipe for target 'all' failed
make: *** [all] Error 127


Top
   
PostPosted: Fri May 05, 2017 12:04 pm 

Joined: Wed May 03, 2017 7:31 pm
Posts: 19
I have also tried: apt-get install libssl-dev:i386 libbz2-dev:i386 liblzo2-dev:i386 , But I get this:


Loading repository data...
Reading installed packages...
'libbz2-dev:i386' not found in package names. Trying capabilities.
No provider of 'libbz2-dev:i386' found.
'liblzo2-dev:i386' not found in package names. Trying capabilities.
No provider of 'liblzo2-dev:i386' found.
'libssl-dev:i386' not found in package names. Trying capabilities.
No provider of 'libssl-dev:i386' found.
Resolving package dependencies...

Nothing to do.


Top
   
PostPosted: Fri May 05, 2017 12:57 pm 
Site Admin
User avatar

Joined: Wed Jul 30, 2014 9:32 pm
Posts: 6722
It's obvious that doesn't work, you don't even have the compiler :)
Try using zypper instead of apt-get and search in the opensuse documentation how to install all the other missing dependencies.


Top
   
PostPosted: Fri May 05, 2017 2:56 pm 

Joined: Wed May 03, 2017 7:31 pm
Posts: 19
aluigi wrote:
It's obvious that doesn't work, you don't even have the compiler :)
Try using zypper instead of apt-get and search in the opensuse documentation how to install all the other missing dependencies.


I am pretty sure I have everything installed. I used one click installs for items i could not find in installer/zypper.
Now I get this:

/usr/include/gnu/stubs.h:7:27: fatal error: gnu/stubs-32.h: No such file or directory
# include <gnu/stubs-32.h>
^
compilation terminated.
In file included from /usr/include/features.h:389:0,
from /usr/include/stdint.h:25,
from /usr/lib64/gcc/x86_64-suse-linux/4.8/include/stdint.h:9,
from libs/brotli/dec/./../common/types.h:24,
from libs/brotli/dec/./state.h:13,
from libs/brotli/dec/state.c:7:
/usr/include/gnu/stubs.h:7:27: fatal error: gnu/stubs-32.h: No such file or directory
# include <gnu/stubs-32.h>
^
compilation terminated.
In file included from /usr/include/features.h:389:0,
from /usr/include/stdint.h:25,
from /usr/lib64/gcc/x86_64-suse-linux/4.8/include/stdint.h:9,
from libs/brotli/common/././types.h:24,
from libs/brotli/common/./dictionary.h:12,
from libs/brotli/common/dictionary.c:7:
/usr/include/gnu/stubs.h:7:27: fatal error: gnu/stubs-32.h: No such file or directory
# include <gnu/stubs-32.h>
^
compilation terminated.
In file included from /usr/include/features.h:389:0,
from /usr/include/stdlib.h:24,
from libs/libbsc/adler32/adler32.cpp:33:
/usr/include/gnu/stubs.h:7:27: fatal error: gnu/stubs-32.h: No such file or directory
# include <gnu/stubs-32.h>
^
compilation terminated.
In file included from /usr/include/features.h:389:0,
from /usr/include/stdlib.h:24,
from libs/libbsc/bwt/bwt.cpp:33:
/usr/include/gnu/stubs.h:7:27: fatal error: gnu/stubs-32.h: No such file or directory
# include <gnu/stubs-32.h>
^
compilation terminated.
In file included from /usr/include/features.h:389:0,
from /usr/include/stdlib.h:24,
from libs/libbsc/coder/coder.cpp:33:
/usr/include/gnu/stubs.h:7:27: fatal error: gnu/stubs-32.h: No such file or directory
# include <gnu/stubs-32.h>
^
compilation terminated.
In file included from /usr/include/features.h:389:0,
from /usr/include/stdlib.h:24,
from libs/libbsc/coder/qlfc/qlfc.cpp:33:
/usr/include/gnu/stubs.h:7:27: fatal error: gnu/stubs-32.h: No such file or directory
# include <gnu/stubs-32.h>
^
compilation terminated.
In file included from /usr/include/features.h:389:0,
from /usr/include/stdlib.h:24,
from libs/libbsc/coder/qlfc/qlfc_model.cpp:33:
/usr/include/gnu/stubs.h:7:27: fatal error: gnu/stubs-32.h: No such file or directory
# include <gnu/stubs-32.h>
^
compilation terminated.
In file included from /usr/include/features.h:389:0,
from /usr/include/stdlib.h:24,
from libs/libbsc/filters/detectors.cpp:33:
/usr/include/gnu/stubs.h:7:27: fatal error: gnu/stubs-32.h: No such file or directory
# include <gnu/stubs-32.h>
^
compilation terminated.
In file included from /usr/include/features.h:389:0,
from /usr/include/stdlib.h:24,
from libs/libbsc/filters/preprocessing.cpp:33:
/usr/include/gnu/stubs.h:7:27: fatal error: gnu/stubs-32.h: No such file or directory
# include <gnu/stubs-32.h>
^
compilation terminated.
In file included from /usr/include/features.h:389:0,
from /usr/include/stdlib.h:24,
from libs/libbsc/libbsc/libbsc.cpp:48:
/usr/include/gnu/stubs.h:7:27: fatal error: gnu/stubs-32.h: No such file or directory
# include <gnu/stubs-32.h>
^
compilation terminated.
In file included from /usr/include/features.h:389:0,
from /usr/include/stdlib.h:24,
from libs/libbsc/lzp/lzp.cpp:33:
/usr/include/gnu/stubs.h:7:27: fatal error: gnu/stubs-32.h: No such file or directory
# include <gnu/stubs-32.h>
^
compilation terminated.
In file included from /usr/include/features.h:389:0,
from /usr/include/stdlib.h:24,
from libs/libbsc/platform/platform.cpp:33:
/usr/include/gnu/stubs.h:7:27: fatal error: gnu/stubs-32.h: No such file or directory
# include <gnu/stubs-32.h>
^
compilation terminated.
In file included from /usr/include/features.h:389:0,
from /usr/include/stdint.h:25,
from /usr/lib64/gcc/x86_64-suse-linux/4.8/include/stdint.h:9,
from libs/shoco/shoco.c:1:
/usr/include/gnu/stubs.h:7:27: fatal error: gnu/stubs-32.h: No such file or directory
# include <gnu/stubs-32.h>
^
compilation terminated.
In file included from /usr/include/features.h:389:0,
from /usr/include/stdint.h:25,
from /usr/lib64/gcc/x86_64-suse-linux/4.8/include/stdint.h:9,
from libs/ms-compress/src/../include/mscomp/general.h:24,
from libs/ms-compress/src/../include/mscomp/internal.h:34,
from libs/ms-compress/src/lznt1_compress.cpp:18:
/usr/include/gnu/stubs.h:7:27: fatal error: gnu/stubs-32.h: No such file or directory
# include <gnu/stubs-32.h>
^
compilation terminated.
In file included from /usr/include/features.h:389:0,
from /usr/include/stdint.h:25,
from /usr/lib64/gcc/x86_64-suse-linux/4.8/include/stdint.h:9,
from libs/ms-compress/src/../include/mscomp/general.h:24,
from libs/ms-compress/src/../include/mscomp/internal.h:34,
from libs/ms-compress/src/lznt1_decompress.cpp:18:
/usr/include/gnu/stubs.h:7:27: fatal error: gnu/stubs-32.h: No such file or directory
# include <gnu/stubs-32.h>
^
compilation terminated.
In file included from /usr/include/features.h:389:0,
from /usr/include/stdint.h:25,
from /usr/lib64/gcc/x86_64-suse-linux/4.8/include/stdint.h:9,
from libs/ms-compress/src/../include/mscomp/general.h:24,
from libs/ms-compress/src/../include/mscomp/internal.h:34,
from libs/ms-compress/src/mscomp.cpp:18:
/usr/include/gnu/stubs.h:7:27: fatal error: gnu/stubs-32.h: No such file or directory
# include <gnu/stubs-32.h>
^
compilation terminated.
In file included from /usr/include/features.h:389:0,
from /usr/include/stdint.h:25,
from /usr/lib64/gcc/x86_64-suse-linux/4.8/include/stdint.h:9,
from libs/ms-compress/src/../include/mscomp/general.h:24,
from libs/ms-compress/src/../include/mscomp/internal.h:34,
from libs/ms-compress/src/xpress_compress.cpp:18:
/usr/include/gnu/stubs.h:7:27: fatal error: gnu/stubs-32.h: No such file or directory
# include <gnu/stubs-32.h>
^
compilation terminated.
In file included from /usr/include/features.h:389:0,
from /usr/include/stdint.h:25,
from /usr/lib64/gcc/x86_64-suse-linux/4.8/include/stdint.h:9,
from libs/ms-compress/src/../include/mscomp/general.h:24,
from libs/ms-compress/src/../include/mscomp/internal.h:34,
from libs/ms-compress/src/xpress_decompress.cpp:18:
/usr/include/gnu/stubs.h:7:27: fatal error: gnu/stubs-32.h: No such file or directory
# include <gnu/stubs-32.h>
^
compilation terminated.
In file included from /usr/include/features.h:389:0,
from /usr/include/stdint.h:25,
from /usr/lib64/gcc/x86_64-suse-linux/4.8/include/stdint.h:9,
from libs/ms-compress/src/../include/mscomp/general.h:24,
from libs/ms-compress/src/../include/mscomp/internal.h:34,
from libs/ms-compress/src/xpress_huff_compress.cpp:18:
/usr/include/gnu/stubs.h:7:27: fatal error: gnu/stubs-32.h: No such file or directory
# include <gnu/stubs-32.h>
^
compilation terminated.
In file included from /usr/include/features.h:389:0,
from /usr/include/stdint.h:25,
from /usr/lib64/gcc/x86_64-suse-linux/4.8/include/stdint.h:9,
from libs/ms-compress/src/../include/mscomp/general.h:24,
from libs/ms-compress/src/../include/mscomp/internal.h:34,
from libs/ms-compress/src/xpress_huff_decompress.cpp:18:
/usr/include/gnu/stubs.h:7:27: fatal error: gnu/stubs-32.h: No such file or directory
# include <gnu/stubs-32.h>
^
compilation terminated.
In file included from /usr/include/features.h:389:0,
from /usr/include/stdio.h:27,
from libs/lzjody/lzjody.c:21:
/usr/include/gnu/stubs.h:7:27: fatal error: gnu/stubs-32.h: No such file or directory
# include <gnu/stubs-32.h>
^
compilation terminated.
In file included from /usr/include/features.h:389:0,
from /usr/include/stdio.h:27,
from disasm/disasm.c:53:
/usr/include/gnu/stubs.h:7:27: fatal error: gnu/stubs-32.h: No such file or directory
# include <gnu/stubs-32.h>
^
compilation terminated.
In file included from /usr/include/features.h:389:0,
from /usr/include/stdio.h:27,
from disasm/assembl/assembl.c:24:
/usr/include/gnu/stubs.h:7:27: fatal error: gnu/stubs-32.h: No such file or directory
# include <gnu/stubs-32.h>
^
compilation terminated.
In file included from /usr/include/features.h:389:0,
from /usr/include/stdio.h:27,
from libs/mydownlib/mydownlib.c:39:
/usr/include/gnu/stubs.h:7:27: fatal error: gnu/stubs-32.h: No such file or directory
# include <gnu/stubs-32.h>
^
compilation terminated.
In file included from /usr/include/features.h:389:0,
from /usr/include/string.h:25,
from libs/TurboRLE/trlec.c:27:
/usr/include/gnu/stubs.h:7:27: fatal error: gnu/stubs-32.h: No such file or directory
# include <gnu/stubs-32.h>
^
compilation terminated.
In file included from /usr/include/features.h:389:0,
from /usr/include/string.h:25,
from libs/TurboRLE/trled.c:27:
/usr/include/gnu/stubs.h:7:27: fatal error: gnu/stubs-32.h: No such file or directory
# include <gnu/stubs-32.h>
^
compilation terminated.
In file included from /usr/include/features.h:389:0,
from /usr/include/stdio.h:27,
from libs/lhasa/lib/lh1_decoder.c:21:
/usr/include/gnu/stubs.h:7:27: fatal error: gnu/stubs-32.h: No such file or directory
# include <gnu/stubs-32.h>
^
compilation terminated.
In file included from /usr/include/features.h:389:0,
from /usr/include/stdio.h:27,
from libs/lhasa/lib/lh_new_decoder.c:33,
from libs/lhasa/lib/lh5_decoder.c:48:
/usr/include/gnu/stubs.h:7:27: fatal error: gnu/stubs-32.h: No such file or directory
# include <gnu/stubs-32.h>
^
compilation terminated.
In file included from /usr/include/features.h:389:0,
from /usr/include/stdio.h:27,
from libs/lhasa/lib/lh_new_decoder.c:33,
from libs/lhasa/lib/lh6_decoder.c:42:
/usr/include/gnu/stubs.h:7:27: fatal error: gnu/stubs-32.h: No such file or directory
# include <gnu/stubs-32.h>
^
compilation terminated.
In file included from /usr/include/features.h:389:0,
from /usr/include/stdio.h:27,
from libs/lhasa/lib/lh_new_decoder.c:33,
from libs/lhasa/lib/lh7_decoder.c:43:
/usr/include/gnu/stubs.h:7:27: fatal error: gnu/stubs-32.h: No such file or directory
# include <gnu/stubs-32.h>
^
compilation terminated.
In file included from /usr/include/features.h:389:0,
from /usr/include/stdio.h:27,
from libs/lhasa/lib/lh_new_decoder.c:33:
/usr/include/gnu/stubs.h:7:27: fatal error: gnu/stubs-32.h: No such file or directory
# include <gnu/stubs-32.h>
^
compilation terminated.
In file included from /usr/include/features.h:389:0,
from /usr/include/stdlib.h:24,
from libs/lhasa/lib/lha_decoder.c:21:
/usr/include/gnu/stubs.h:7:27: fatal error: gnu/stubs-32.h: No such file or directory
# include <gnu/stubs-32.h>
^
compilation terminated.
In file included from /usr/include/features.h:389:0,
from /usr/include/stdio.h:27,
from libs/lhasa/lib/lh_new_decoder.c:33,
from libs/lhasa/lib/lhx_decoder.c:44:
/usr/include/gnu/stubs.h:7:27: fatal error: gnu/stubs-32.h: No such file or directory
# include <gnu/stubs-32.h>
^
compilation terminated.
In file included from /usr/include/features.h:389:0,
from /usr/include/stdlib.h:24,
from libs/lhasa/lib/lz5_decoder.c:21:
/usr/include/gnu/stubs.h:7:27: fatal error: gnu/stubs-32.h: No such file or directory
# include <gnu/stubs-32.h>
^
compilation terminated.
In file included from /usr/include/features.h:389:0,
from /usr/include/stdlib.h:24,
from libs/lhasa/lib/lzs_decoder.c:21:
/usr/include/gnu/stubs.h:7:27: fatal error: gnu/stubs-32.h: No such file or directory
# include <gnu/stubs-32.h>
^
compilation terminated.
In file included from /usr/include/features.h:389:0,
from /usr/include/stdlib.h:24,
from libs/lhasa/lib/null_decoder.c:23:
/usr/include/gnu/stubs.h:7:27: fatal error: gnu/stubs-32.h: No such file or directory
# include <gnu/stubs-32.h>
^
compilation terminated.
In file included from /usr/include/features.h:389:0,
from /usr/include/stdlib.h:24,
from libs/lhasa/lib/pm1_decoder.c:31:
/usr/include/gnu/stubs.h:7:27: fatal error: gnu/stubs-32.h: No such file or directory
# include <gnu/stubs-32.h>
^
compilation terminated.
In file included from /usr/include/features.h:389:0,
from /usr/include/stdio.h:27,
from libs/lhasa/lib/pm2_decoder.c:26:
/usr/include/gnu/stubs.h:7:27: fatal error: gnu/stubs-32.h: No such file or directory
# include <gnu/stubs-32.h>
^
compilation terminated.
In file included from /usr/include/features.h:389:0,
from /usr/include/inttypes.h:25,
from libs/lhasa/lib/crc16.h:24,
from libs/lhasa/lib/crc16.c:21:
/usr/include/gnu/stubs.h:7:27: fatal error: gnu/stubs-32.h: No such file or directory
# include <gnu/stubs-32.h>
^
compilation terminated.
In file included from /usr/include/features.h:389:0,
from /usr/include/stdlib.h:24,
from libs/dipperstein/adapt.c:40:
/usr/include/gnu/stubs.h:7:27: fatal error: gnu/stubs-32.h: No such file or directory
# include <gnu/stubs-32.h>
^
compilation terminated.
In file included from /usr/include/features.h:389:0,
from /usr/include/stdio.h:27,
from libs/dipperstein/arcode.c:37:
/usr/include/gnu/stubs.h:7:27: fatal error: gnu/stubs-32.h: No such file or directory
# include <gnu/stubs-32.h>
^
compilation terminated.
In file included from /usr/include/features.h:389:0,
from /usr/include/stdio.h:27,
from libs/dipperstein/bitarray.c:67:
/usr/include/gnu/stubs.h:7:27: fatal error: gnu/stubs-32.h: No such file or directory
# include <gnu/stubs-32.h>
^
compilation terminated.
In file included from /usr/include/features.h:389:0,
from /usr/include/stdlib.h:24,
from libs/dipperstein/bitfile.c:40:
/usr/include/gnu/stubs.h:7:27: fatal error: gnu/stubs-32.h: No such file or directory
# include <gnu/stubs-32.h>
^
compilation terminated.
In file included from /usr/include/features.h:389:0,
from /usr/include/stdio.h:27,
from libs/dipperstein/canonical.c:35:
/usr/include/gnu/stubs.h:7:27: fatal error: gnu/stubs-32.h: No such file or directory
# include <gnu/stubs-32.h>
^
compilation terminated.
In file included from /usr/include/features.h:389:0,
from /usr/include/stdio.h:27,
from libs/dipperstein/delta.c:35:
/usr/include/gnu/stubs.h:7:27: fatal error: gnu/stubs-32.h: No such file or directory
# include <gnu/stubs-32.h>
^
compilation terminated.
In file included from /usr/include/features.h:389:0,
from /usr/include/stdio.h:27,
from libs/dipperstein/freqsub.c:45:
/usr/include/gnu/stubs.h:7:27: fatal error: gnu/stubs-32.h: No such file or directory
# include <gnu/stubs-32.h>
^
compilation terminated.
In file included from /usr/include/features.h:389:0,
from /usr/include/stdio.h:27,
from libs/dipperstein/huffman.c:35:
/usr/include/gnu/stubs.h:7:27: fatal error: gnu/stubs-32.h: No such file or directory
# include <gnu/stubs-32.h>
^
compilation terminated.
In file included from /usr/include/features.h:389:0,
from /usr/include/stdio.h:27,
from libs/dipperstein/huflocal.c:36:
/usr/include/gnu/stubs.h:7:27: fatal error: gnu/stubs-32.h: No such file or directory
# include <gnu/stubs-32.h>
^
compilation terminated.
In file included from /usr/include/features.h:389:0,
from /usr/include/limits.h:25,
from /usr/lib64/gcc/x86_64-suse-linux/4.8/include-fixed/limits.h:168,
from /usr/lib64/gcc/x86_64-suse-linux/4.8/include-fixed/syslimits.h:7,
from /usr/lib64/gcc/x86_64-suse-linux/4.8/include-fixed/limits.h:34,
from libs/dipperstein/lzlocal.h:39,
from libs/dipperstein/kmp.c:40:
/usr/include/gnu/stubs.h:7:27: fatal error: gnu/stubs-32.h: No such file or directory
# include <gnu/stubs-32.h>
^
compilation terminated.
In file included from /usr/include/features.h:389:0,
from /usr/include/stdio.h:27,
from libs/dipperstein/lzss.c:36:
/usr/include/gnu/stubs.h:7:27: fatal error: gnu/stubs-32.h: No such file or directory
# include <gnu/stubs-32.h>
^
compilation terminated.
In file included from /usr/include/features.h:389:0,
from /usr/include/stdio.h:27,
from libs/dipperstein/lzwdecode.c:36:
/usr/include/gnu/stubs.h:7:27: fatal error: gnu/stubs-32.h: No such file or directory
# include <gnu/stubs-32.h>
^
compilation terminated.
In file included from /usr/include/features.h:389:0,
from /usr/include/stdio.h:27,
from libs/dipperstein/lzwencode.c:36:
/usr/include/gnu/stubs.h:7:27: fatal error: gnu/stubs-32.h: No such file or directory
# include <gnu/stubs-32.h>
^
compilation terminated.
In file included from /usr/include/features.h:389:0,
from /usr/include/stdio.h:27,
from libs/dipperstein/rice.c:43:
/usr/include/gnu/stubs.h:7:27: fatal error: gnu/stubs-32.h: No such file or directory
# include <gnu/stubs-32.h>
^
compilation terminated.
In file included from /usr/include/features.h:389:0,
from /usr/include/stdio.h:27,
from libs/dipperstein/rle.c:50:
/usr/include/gnu/stubs.h:7:27: fatal error: gnu/stubs-32.h: No such file or directory
# include <gnu/stubs-32.h>
^
compilation terminated.
In file included from /usr/include/features.h:389:0,
from /usr/include/stdio.h:27,
from libs/dipperstein/vpackbits.c:62:
/usr/include/gnu/stubs.h:7:27: fatal error: gnu/stubs-32.h: No such file or directory
# include <gnu/stubs-32.h>
^
compilation terminated.
In file included from /usr/include/features.h:389:0,
from /usr/include/string.h:25,
from libs/liblzf/lzfP.h:170,
from libs/liblzf/lzf_d.c:37:
/usr/include/gnu/stubs.h:7:27: fatal error: gnu/stubs-32.h: No such file or directory
# include <gnu/stubs-32.h>
^
compilation terminated.
In file included from /usr/include/features.h:389:0,
from /usr/include/string.h:25,
from libs/liblzf/lzfP.h:170,
from libs/liblzf/lzf_c_best.c:37:
/usr/include/gnu/stubs.h:7:27: fatal error: gnu/stubs-32.h: No such file or directory
# include <gnu/stubs-32.h>
^
compilation terminated.
In file included from /usr/include/features.h:389:0,
from /usr/include/stdlib.h:24,
from libs/zopfli/blocksplitter.h:31,
from libs/zopfli/blocksplitter.c:20:
/usr/include/gnu/stubs.h:7:27: fatal error: gnu/stubs-32.h: No such file or directory
# include <gnu/stubs-32.h>
^
compilation terminated.
In file included from /usr/include/features.h:389:0,
from /usr/include/string.h:25,
from libs/zopfli/util.h:28,
from libs/zopfli/cache.h:27,
from libs/zopfli/cache.c:20:
/usr/include/gnu/stubs.h:7:27: fatal error: gnu/stubs-32.h: No such file or directory
# include <gnu/stubs-32.h>
^
compilation terminated.
In file included from /usr/include/features.h:389:0,
from /usr/include/stdlib.h:24,
from libs/zopfli/lz77.h:28,
from libs/zopfli/deflate.h:28,
from libs/zopfli/deflate.c:20:
/usr/include/gnu/stubs.h:7:27: fatal error: gnu/stubs-32.h: No such file or directory
# include <gnu/stubs-32.h>
^
compilation terminated.
In file included from /usr/include/features.h:389:0,
from /usr/include/stdlib.h:24,
from libs/zopfli/zopfli.h:24,
from libs/zopfli/gzip_container.h:27,
from libs/zopfli/gzip_container.c:20:
/usr/include/gnu/stubs.h:7:27: fatal error: gnu/stubs-32.h: No such file or directory
# include <gnu/stubs-32.h>
^
compilation terminated.
In file included from /usr/include/features.h:389:0,
from /usr/include/string.h:25,
from libs/zopfli/util.h:28,
from libs/zopfli/hash.h:27,
from libs/zopfli/hash.c:20:
/usr/include/gnu/stubs.h:7:27: fatal error: gnu/stubs-32.h: No such file or directory
# include <gnu/stubs-32.h>
^
compilation terminated.
In file included from /usr/include/features.h:389:0,
from /usr/include/string.h:25,
from libs/zopfli/katajainen.h:23,
from libs/zopfli/katajainen.c:26:
/usr/include/gnu/stubs.h:7:27: fatal error: gnu/stubs-32.h: No such file or directory
# include <gnu/stubs-32.h>
^
compilation terminated.
In file included from /usr/include/features.h:389:0,
from /usr/include/stdlib.h:24,
from libs/zopfli/lz77.h:28,
from libs/zopfli/lz77.c:20:
/usr/include/gnu/stubs.h:7:27: fatal error: gnu/stubs-32.h: No such file or directory
# include <gnu/stubs-32.h>
^
compilation terminated.
In file included from /usr/include/features.h:389:0,
from /usr/include/stdlib.h:24,
from libs/zopfli/lz77.h:28,
from libs/zopfli/squeeze.h:34,
from libs/zopfli/squeeze.c:20:
/usr/include/gnu/stubs.h:7:27: fatal error: gnu/stubs-32.h: No such file or directory
# include <gnu/stubs-32.h>
^
compilation terminated.
In file included from /usr/include/features.h:389:0,
from /usr/include/string.h:25,
from libs/zopfli/tree.h:27,
from libs/zopfli/tree.c:20:
/usr/include/gnu/stubs.h:7:27: fatal error: gnu/stubs-32.h: No such file or directory
# include <gnu/stubs-32.h>
^
compilation terminated.
In file included from /usr/include/features.h:389:0,
from /usr/include/string.h:25,
from libs/zopfli/util.h:28,
from libs/zopfli/util.c:20:
/usr/include/gnu/stubs.h:7:27: fatal error: gnu/stubs-32.h: No such file or directory
# include <gnu/stubs-32.h>
^
compilation terminated.
In file included from /usr/include/features.h:389:0,
from /usr/include/stdlib.h:24,
from libs/zopfli/zopfli.h:24,
from libs/zopfli/zlib_container.h:27,
from libs/zopfli/zlib_container.c:20:
/usr/include/gnu/stubs.h:7:27: fatal error: gnu/stubs-32.h: No such file or directory
# include <gnu/stubs-32.h>
^
compilation terminated.
In file included from /usr/include/features.h:389:0,
from /usr/include/stdlib.h:24,
from libs/zopfli/zopfli.h:24,
from libs/zopfli/zopfli_lib.c:20:
/usr/include/gnu/stubs.h:7:27: fatal error: gnu/stubs-32.h: No such file or directory
# include <gnu/stubs-32.h>
^
compilation terminated.
In file included from /usr/include/features.h:389:0,
from /usr/include/stdlib.h:24,
from libs/lzham_codec/lzhamdecomp/lzham_core.h:241,
from libs/lzham_codec/lzhamcomp/lzham_lzbase.cpp:3:
/usr/include/gnu/stubs.h:7:27: fatal error: gnu/stubs-32.h: No such file or directory
# include <gnu/stubs-32.h>
^
compilation terminated.
In file included from /usr/include/features.h:389:0,
from /usr/include/stdlib.h:24,
from libs/lzham_codec/lzhamdecomp/lzham_core.h:241,
from libs/lzham_codec/lzhamcomp/lzham_lzcomp.cpp:3:
/usr/include/gnu/stubs.h:7:27: fatal error: gnu/stubs-32.h: No such file or directory
# include <gnu/stubs-32.h>
^
compilation terminated.
In file included from /usr/include/features.h:389:0,
from /usr/include/stdlib.h:24,
from libs/lzham_codec/lzhamdecomp/lzham_core.h:241,
from libs/lzham_codec/lzhamcomp/lzham_lzcomp_internal.cpp:3:
/usr/include/gnu/stubs.h:7:27: fatal error: gnu/stubs-32.h: No such file or directory
# include <gnu/stubs-32.h>
^
compilation terminated.
In file included from /usr/include/features.h:389:0,
from /usr/include/stdlib.h:24,
from libs/lzham_codec/lzhamdecomp/lzham_core.h:241,
from libs/lzham_codec/lzhamcomp/lzham_lzcomp_state.cpp:3:
/usr/include/gnu/stubs.h:7:27: fatal error: gnu/stubs-32.h: No such file or directory
# include <gnu/stubs-32.h>
^
compilation terminated.
In file included from /usr/include/features.h:389:0,
from /usr/include/stdlib.h:24,
from libs/lzham_codec/lzhamdecomp/lzham_core.h:241,
from libs/lzham_codec/lzhamcomp/lzham_match_accel.cpp:3:
/usr/include/gnu/stubs.h:7:27: fatal error: gnu/stubs-32.h: No such file or directory
# include <gnu/stubs-32.h>
^
compilation terminated.
In file included from /usr/include/features.h:389:0,
from /usr/include/stdlib.h:24,
from libs/lzham_codec/lzhamdecomp/lzham_core.h:241,
from libs/lzham_codec/lzhamcomp/lzham_pthreads_threading.cpp:22:
/usr/include/gnu/stubs.h:7:27: fatal error: gnu/stubs-32.h: No such file or directory
# include <gnu/stubs-32.h>
^
compilation terminated.
In file included from /usr/include/features.h:389:0,
from /usr/include/stdlib.h:24,
from libs/lzham_codec/lzhamdecomp/lzham_core.h:241,
from libs/lzham_codec/lzhamdecomp/lzham_assert.cpp:3:
/usr/include/gnu/stubs.h:7:27: fatal error: gnu/stubs-32.h: No such file or directory
# include <gnu/stubs-32.h>
^
compilation terminated.
In file included from /usr/include/features.h:389:0,
from /usr/include/stdlib.h:24,
from libs/lzham_codec/lzhamdecomp/lzham_core.h:241,
from libs/lzham_codec/lzhamdecomp/lzham_checksum.cpp:2:
/usr/include/gnu/stubs.h:7:27: fatal error: gnu/stubs-32.h: No such file or directory
# include <gnu/stubs-32.h>
^
compilation terminated.
In file included from /usr/include/features.h:389:0,
from /usr/include/stdlib.h:24,
from libs/lzham_codec/lzhamdecomp/lzham_core.h:241,
from libs/lzham_codec/lzhamdecomp/lzham_huffman_codes.cpp:3:
/usr/include/gnu/stubs.h:7:27: fatal error: gnu/stubs-32.h: No such file or directory
# include <gnu/stubs-32.h>
^
compilation terminated.
In file included from /usr/include/features.h:389:0,
from /usr/include/stdlib.h:24,
from libs/lzham_codec/lzhamdecomp/lzham_core.h:241,
from libs/lzham_codec/lzhamdecomp/lzham_lzdecomp.cpp:8:
/usr/include/gnu/stubs.h:7:27: fatal error: gnu/stubs-32.h: No such file or directory
# include <gnu/stubs-32.h>
^
compilation terminated.
In file included from /usr/include/features.h:389:0,
from /usr/include/stdlib.h:24,
from libs/lzham_codec/lzhamdecomp/lzham_core.h:241,
from libs/lzham_codec/lzhamdecomp/lzham_lzdecompbase.cpp:3:
/usr/include/gnu/stubs.h:7:27: fatal error: gnu/stubs-32.h: No such file or directory
# include <gnu/stubs-32.h>
^
compilation terminated.
In file included from /usr/include/features.h:389:0,
from /usr/include/stdlib.h:24,
from libs/lzham_codec/lzhamdecomp/lzham_core.h:241,
from libs/lzham_codec/lzhamdecomp/lzham_mem.cpp:3:
/usr/include/gnu/stubs.h:7:27: fatal error: gnu/stubs-32.h: No such file or directory
# include <gnu/stubs-32.h>
^
compilation terminated.
In file included from /usr/include/features.h:389:0,
from /usr/include/stdlib.h:24,
from libs/lzham_codec/lzhamdecomp/lzham_core.h:241,
from libs/lzham_codec/lzhamdecomp/lzham_platform.cpp:4:
/usr/include/gnu/stubs.h:7:27: fatal error: gnu/stubs-32.h: No such file or directory
# include <gnu/stubs-32.h>
^
compilation terminated.
In file included from /usr/include/features.h:389:0,
from /usr/include/stdlib.h:24,
from libs/lzham_codec/lzhamdecomp/lzham_core.h:241,
from libs/lzham_codec/lzhamdecomp/lzham_prefix_coding.cpp:3:
/usr/include/gnu/stubs.h:7:27: fatal error: gnu/stubs-32.h: No such file or directory
# include <gnu/stubs-32.h>
^
compilation terminated.
In file included from /usr/include/features.h:389:0,
from /usr/include/stdlib.h:24,
from libs/lzham_codec/lzhamdecomp/lzham_core.h:241,
from libs/lzham_codec/lzhamdecomp/lzham_symbol_codec.cpp:3:
/usr/include/gnu/stubs.h:7:27: fatal error: gnu/stubs-32.h: No such file or directory
# include <gnu/stubs-32.h>
^
compilation terminated.
In file included from /usr/include/features.h:389:0,
from /usr/include/stdlib.h:24,
from libs/lzham_codec/lzhamdecomp/lzham_core.h:241,
from libs/lzham_codec/lzhamdecomp/lzham_timer.cpp:3:
/usr/include/gnu/stubs.h:7:27: fatal error: gnu/stubs-32.h: No such file or directory
# include <gnu/stubs-32.h>
^
compilation terminated.
In file included from /usr/include/features.h:389:0,
from /usr/include/stdlib.h:24,
from libs/lzham_codec/lzhamdecomp/lzham_core.h:241,
from libs/lzham_codec/lzhamdecomp/lzham_vector.cpp:3:
/usr/include/gnu/stubs.h:7:27: fatal error: gnu/stubs-32.h: No such file or directory
# include <gnu/stubs-32.h>
^
compilation terminated.
In file included from /usr/include/features.h:389:0,
from /usr/include/stdlib.h:24,
from libs/lzham_codec/lzhamdecomp/lzham_core.h:241,
from libs/lzham_codec/lzhamlib/lzham_lib.cpp:3:
/usr/include/gnu/stubs.h:7:27: fatal error: gnu/stubs-32.h: No such file or directory
# include <gnu/stubs-32.h>
^
compilation terminated.
In file included from /usr/include/features.h:389:0,
from /usr/include/stdio.h:27,
from libs/dmsdos/dmsdos.h:697,
from libs/dmsdos/dblspace_dec.c:46:
/usr/include/gnu/stubs.h:7:27: fatal error: gnu/stubs-32.h: No such file or directory
# include <gnu/stubs-32.h>
^
compilation terminated.
In file included from /usr/include/features.h:389:0,
from /usr/include/stdio.h:27,
from libs/dmsdos/dmsdos.h:697,
from libs/dmsdos/dstacker_dec.c:54:
/usr/include/gnu/stubs.h:7:27: fatal error: gnu/stubs-32.h: No such file or directory
# include <gnu/stubs-32.h>
^
compilation terminated.
In file included from /usr/include/features.h:389:0,
from /usr/include/stdio.h:27,
from libs/tornado/Compression.h:3,
from libs/tornado/Tornado.cpp:11:
/usr/include/gnu/stubs.h:7:27: fatal error: gnu/stubs-32.h: No such file or directory
# include <gnu/stubs-32.h>
^
compilation terminated.
In file included from /usr/include/features.h:389:0,
from /usr/include/stdlib.h:24,
from libs/tornado/Common.cpp:4:
/usr/include/gnu/stubs.h:7:27: fatal error: gnu/stubs-32.h: No such file or directory
# include <gnu/stubs-32.h>
^
compilation terminated.
In file included from /usr/include/features.h:389:0,
from /usr/include/string.h:25,
from libs/PKLib/pklib.h:14,
from libs/PKLib/explode.c:13:
/usr/include/gnu/stubs.h:7:27: fatal error: gnu/stubs-32.h: No such file or directory
# include <gnu/stubs-32.h>
^
compilation terminated.
In file included from /usr/include/features.h:389:0,
from /usr/include/string.h:25,
from libs/PKLib/pklib.h:14,
from libs/PKLib/implode.c:14:
/usr/include/gnu/stubs.h:7:27: fatal error: gnu/stubs-32.h: No such file or directory
# include <gnu/stubs-32.h>
^
compilation terminated.
In file included from /usr/include/features.h:389:0,
from /usr/include/stdio.h:27,
from extra/mybits.c:4:
/usr/include/gnu/stubs.h:7:27: fatal error: gnu/stubs-32.h: No such file or directory
# include <gnu/stubs-32.h>
^
compilation terminated.
In file included from /usr/include/features.h:389:0,
from /usr/include/stdlib.h:24,
from libs/lz5/lz5common.h:69,
from libs/lz5/lz5.c:41:
/usr/include/gnu/stubs.h:7:27: fatal error: gnu/stubs-32.h: No such file or directory
# include <gnu/stubs-32.h>
^
compilation terminated.
In file included from /usr/include/features.h:389:0,
from /usr/include/stdlib.h:24,
from libs/lz5/lz5frame.c:52:
/usr/include/gnu/stubs.h:7:27: fatal error: gnu/stubs-32.h: No such file or directory
# include <gnu/stubs-32.h>
^
compilation terminated.
In file included from /usr/include/features.h:389:0,
from /usr/include/stdlib.h:24,
from libs/lz5/lz5common.h:69,
from libs/lz5/lz5hc.c:43:
/usr/include/gnu/stubs.h:7:27: fatal error: gnu/stubs-32.h: No such file or directory
# include <gnu/stubs-32.h>
^
compilation terminated.
In file included from /usr/include/features.h:389:0,
from /usr/include/stdlib.h:24,
from libs/lizard/lizard_common.h:46,
from libs/lizard/lizard_compress.c:40:
/usr/include/gnu/stubs.h:7:27: fatal error: gnu/stubs-32.h: No such file or directory
# include <gnu/stubs-32.h>
^
compilation terminated.
In file included from /usr/include/features.h:389:0,
from /usr/include/string.h:25,
from libs/lizard/entropy/mem.h:21,
from libs/lizard/lizard_decompress.h:42,
from libs/lizard/lizard_decompress.c:44:
/usr/include/gnu/stubs.h:7:27: fatal error: gnu/stubs-32.h: No such file or directory
# include <gnu/stubs-32.h>
^
compilation terminated.
In file included from /usr/include/features.h:389:0,
from /usr/include/string.h:25,
from libs/lizard/entropy/mem.h:21,
from libs/lizard/lizard_decompress.h:42,
from libs/lizard/lizard_frame.c:55:
/usr/include/gnu/stubs.h:7:27: fatal error: gnu/stubs-32.h: No such file or directory
# include <gnu/stubs-32.h>
^
compilation terminated.
In file included from /usr/include/features.h:389:0,
from /usr/include/stdio.h:27,
from libs/ppmz2/stdafx.h:4,
from libs/ppmz2/ArithInfo.cpp:1:
/usr/include/gnu/stubs.h:7:27: fatal error: gnu/stubs-32.h: No such file or directory
# include <gnu/stubs-32.h>
^
compilation terminated.
In file included from /usr/include/features.h:389:0,
from /usr/include/stdio.h:27,
from libs/ppmz2/stdafx.h:4,
from libs/ppmz2/Coder.cpp:1:
/usr/include/gnu/stubs.h:7:27: fatal error: gnu/stubs-32.h: No such file or directory
# include <gnu/stubs-32.h>
^
compilation terminated.
In file included from /usr/include/features.h:389:0,
from /usr/include/stdio.h:27,
from libs/ppmz2/stdafx.h:4,
from libs/ppmz2/CodingMetrics.cpp:1:
/usr/include/gnu/stubs.h:7:27: fatal error: gnu/stubs-32.h: No such file or directory
# include <gnu/stubs-32.h>
^
compilation terminated.
In file included from /usr/include/features.h:389:0,
from /usr/include/stdio.h:27,
from libs/ppmz2/stdafx.h:4,
from libs/ppmz2/Context.cpp:1:
/usr/include/gnu/stubs.h:7:27: fatal error: gnu/stubs-32.h: No such file or directory
# include <gnu/stubs-32.h>
^
compilation terminated.
In file included from /usr/include/features.h:389:0,
from /usr/include/stdio.h:27,
from libs/ppmz2/stdafx.h:4,
from libs/ppmz2/ContextData.cpp:1:
/usr/include/gnu/stubs.h:7:27: fatal error: gnu/stubs-32.h: No such file or directory
# include <gnu/stubs-32.h>
^
compilation terminated.
In file included from /usr/include/features.h:389:0,
from /usr/include/stdio.h:27,
from libs/ppmz2/stdafx.h:4,
from libs/ppmz2/ContextTrie.cpp:1:
/usr/include/gnu/stubs.h:7:27: fatal error: gnu/stubs-32.h: No such file or directory
# include <gnu/stubs-32.h>
^
compilation terminated.
In file included from /usr/include/features.h:389:0,
from /usr/include/stdio.h:27,
from libs/ppmz2/stdafx.h:4,
from libs/ppmz2/CrbList.c:1:
/usr/include/gnu/stubs.h:7:27: fatal error: gnu/stubs-32.h: No such file or directory
# include <gnu/stubs-32.h>
^
compilation terminated.
In file included from /usr/include/features.h:389:0,
from /usr/include/stdio.h:27,
from libs/ppmz2/stdafx.h:4,
from libs/ppmz2/Exclude.cpp:1:
/usr/include/gnu/stubs.h:7:27: fatal error: gnu/stubs-32.h: No such file or directory
# include <gnu/stubs-32.h>
^
compilation terminated.
In file included from /usr/include/features.h:389:0,
from /usr/include/stdio.h:27,
from libs/ppmz2/stdafx.h:4,
from libs/ppmz2/LocalOrderEstimation.cpp:1:
/usr/include/gnu/stubs.h:7:27: fatal error: gnu/stubs-32.h: No such file or directory
# include <gnu/stubs-32.h>
^
compilation terminated.
In file included from /usr/include/features.h:389:0,
from /usr/include/stdio.h:27,
from libs/ppmz2/stdafx.h:4,
from libs/ppmz2/PPMZ2.cpp:1:
/usr/include/gnu/stubs.h:7:27: fatal error: gnu/stubs-32.h: No such file or directory
# include <gnu/stubs-32.h>
^
compilation terminated.
In file included from /usr/include/features.h:389:0,
from /usr/include/stdio.h:27,
from libs/ppmz2/stdafx.h:4,
from libs/ppmz2/PpmDet.cpp:1:
/usr/include/gnu/stubs.h:7:27: fatal error: gnu/stubs-32.h: No such file or directory
# include <gnu/stubs-32.h>
^
compilation terminated.
In file included from /usr/include/features.h:389:0,
from /usr/include/stdio.h:27,
from libs/ppmz2/stdafx.h:4,
from libs/ppmz2/PpmzEsc.cpp:1:
/usr/include/gnu/stubs.h:7:27: fatal error: gnu/stubs-32.h: No such file or directory
# include <gnu/stubs-32.h>
^
compilation terminated.
In file included from /usr/include/features.h:389:0,
from /usr/include/stdio.h:27,
from libs/ppmz2/stdafx.h:4,
from libs/ppmz2/See.cpp:1:
/usr/include/gnu/stubs.h:7:27: fatal error: gnu/stubs-32.h: No such file or directory
# include <gnu/stubs-32.h>
^
compilation terminated.
In file included from /usr/include/features.h:389:0,
from /usr/include/stdio.h:27,
from libs/ppmz2/stdafx.h:4,
from libs/ppmz2/Stdafx.cpp:5:
/usr/include/gnu/stubs.h:7:27: fatal error: gnu/stubs-32.h: No such file or directory
# include <gnu/stubs-32.h>
^
compilation terminated.
In file included from /usr/include/features.h:389:0,
from /usr/include/stdio.h:27,
from libs/ppmz2/stdafx.h:4,
from libs/ppmz2/Stopwatch.cpp:1:
/usr/include/gnu/stubs.h:7:27: fatal error: gnu/stubs-32.h: No such file or directory
# include <gnu/stubs-32.h>
^
compilation terminated.
In file included from /usr/include/features.h:389:0,
from /usr/include/assert.h:35,
from libs/libdivsufsort/divsufsort.c:39:
/usr/include/gnu/stubs.h:7:27: fatal error: gnu/stubs-32.h: No such file or directory
# include <gnu/stubs-32.h>
^
compilation terminated.
In file included from /usr/include/features.h:389:0,
from /usr/include/stdlib.h:24,
from libs/xxhash/xxhash.c:101:
/usr/include/gnu/stubs.h:7:27: fatal error: gnu/stubs-32.h: No such file or directory
# include <gnu/stubs-32.h>
^
compilation terminated.
In file included from /usr/include/features.h:389:0,
from /usr/include/stdio.h:27,
from extra/xalloc.c:60:
/usr/include/gnu/stubs.h:7:27: fatal error: gnu/stubs-32.h: No such file or directory
# include <gnu/stubs-32.h>
^
compilation terminated.
In file included from /usr/include/features.h:389:0,
from /usr/include/stdint.h:25,
from /usr/lib64/gcc/x86_64-suse-linux/4.8/include/stdint.h:9,
from libs/lzfse/src/lzfse.h:26,
from libs/lzfse/src/lzfse_decode.c:24:
/usr/include/gnu/stubs.h:7:27: fatal error: gnu/stubs-32.h: No such file or directory
# include <gnu/stubs-32.h>
^
compilation terminated.
In file included from /usr/include/features.h:389:0,
from /usr/include/assert.h:35,
from libs/lzfse/src/lzfse_fse.h:28,
from libs/lzfse/src/lzfse_internal.h:30,
from libs/lzfse/src/lzfse_decode_base.c:22:
/usr/include/gnu/stubs.h:7:27: fatal error: gnu/stubs-32.h: No such file or directory
# include <gnu/stubs-32.h>
^
compilation terminated.
In file included from /usr/include/features.h:389:0,
from /usr/include/stdint.h:25,
from /usr/lib64/gcc/x86_64-suse-linux/4.8/include/stdint.h:9,
from libs/lzfse/src/lzfse.h:26,
from libs/lzfse/src/lzfse_encode.c:24:
/usr/include/gnu/stubs.h:7:27: fatal error: gnu/stubs-32.h: No such file or directory
# include <gnu/stubs-32.h>
^
compilation terminated.
In file included from /usr/include/features.h:389:0,
from /usr/include/assert.h:35,
from libs/lzfse/src/lzfse_fse.h:28,
from libs/lzfse/src/lzfse_internal.h:30,
from libs/lzfse/src/lzfse_encode_base.c:24:
/usr/include/gnu/stubs.h:7:27: fatal error: gnu/stubs-32.h: No such file or directory
# include <gnu/stubs-32.h>
^
compilation terminated.
In file included from /usr/include/features.h:389:0,
from /usr/include/assert.h:35,
from libs/lzfse/src/lzfse_fse.h:28,
from libs/lzfse/src/lzfse_internal.h:30,
from libs/lzfse/src/lzfse_fse.c:22:
/usr/include/gnu/stubs.h:7:27: fatal error: gnu/stubs-32.h: No such file or directory
# include <gnu/stubs-32.h>
^
compilation terminated.
In file included from /usr/include/features.h:389:0,
from /usr/include/assert.h:35,
from libs/lzfse/src/lzfse_fse.h:28,
from libs/lzfse/src/lzfse_internal.h:30,
from libs/lzfse/src/lzvn_decode_base.h:29,
from libs/lzfse/src/lzvn_decode_base.c:24:
/usr/include/gnu/stubs.h:7:27: fatal error: gnu/stubs-32.h: No such file or directory
# include <gnu/stubs-32.h>
^
compilation terminated.
In file included from /usr/include/features.h:389:0,
from /usr/include/assert.h:35,
from libs/lzfse/src/lzfse_fse.h:28,
from libs/lzfse/src/lzfse_internal.h:30,
from libs/lzfse/src/lzvn_encode_base.h:27,
from libs/lzfse/src/lzvn_encode_base.c:24:
/usr/include/gnu/stubs.h:7:27: fatal error: gnu/stubs-32.h: No such file or directory
# include <gnu/stubs-32.h>
^
compilation terminated.
In file included from /usr/include/features.h:389:0,
from /usr/include/stdio.h:27,
from libs/hsel/myhsel.cpp:1:
/usr/include/gnu/stubs.h:7:27: fatal error: gnu/stubs-32.h: No such file or directory
# include <gnu/stubs-32.h>
^
compilation terminated.
In file included from /usr/include/features.h:389:0,
from /usr/include/stdio.h:27,
from libs/hsel/HSEL.h:4,
from libs/hsel/HSEL.cpp:4:
/usr/include/gnu/stubs.h:7:27: fatal error: gnu/stubs-32.h: No such file or directory
# include <gnu/stubs-32.h>
^
compilation terminated.
In file included from /usr/include/features.h:389:0,
from /usr/include/inttypes.h:25,
from libs/glza/GLZAmodel.c:19:
/usr/include/gnu/stubs.h:7:27: fatal error: gnu/stubs-32.h: No such file or directory
# include <gnu/stubs-32.h>
^
compilation terminated.
In file included from /usr/include/features.h:389:0,
from /usr/include/limits.h:25,
from /usr/lib64/gcc/x86_64-suse-linux/4.8/include-fixed/limits.h:168,
from /usr/lib64/gcc/x86_64-suse-linux/4.8/include-fixed/syslimits.h:7,
from /usr/lib64/gcc/x86_64-suse-linux/4.8/include-fixed/limits.h:34,
from libs/minilzo/minilzo.c:45:
/usr/include/gnu/stubs.h:7:27: fatal error: gnu/stubs-32.h: No such file or directory
# include <gnu/stubs-32.h>
^
compilation terminated.
Makefile:25: recipe for target 'all' failed
make: *** [all] Error 1


Top
   
PostPosted: Fri May 05, 2017 5:38 pm 
Site Admin
User avatar

Joined: Wed Jul 30, 2014 9:32 pm
Posts: 6722
That means your gcc installation is incomplete.
What I can suggest you is just to search on Google because you can find all the answers to this problem (tested just now), it's useless and boring that I do the search for you.


Top
   
PostPosted: Fri May 05, 2017 9:17 pm 

Joined: Wed May 03, 2017 7:31 pm
Posts: 19
aluigi wrote:
That means your gcc installation is incomplete.
What I can suggest you is just to search on Google because you can find all the answers to this problem (tested just now), it's useless and boring that I do the search for you.


I agree, I dont want anyone to do the work for me. I like to learn so i know how. Sorry, am a bit new to linux, but I like it. The only thing I miss about winblows is the Installers ready to go lol.

Thank You


Top
   
PostPosted: Sat May 06, 2017 2:32 am 

Joined: Wed May 03, 2017 7:31 pm
Posts: 19
aluigi wrote:
That means your gcc installation is incomplete.
What I can suggest you is just to search on Google because you can find all the answers to this problem (tested just now), it's useless and boring that I do the search for you.



I have tried to find a solution to my problem, I have not been successful as of yet, One thing I am a bit confused on. You said gcc is incomplete, but the error i get seems like openssl is the issue. Did you perhaps mean openssl? the error is:
fatal error: openssl/ossl_typ.h: No such file or directory
#include <openssl/ossl_typ.h>
^
compilation terminated.
Thanks ....


Top
   
PostPosted: Sat May 06, 2017 8:11 am 

Joined: Wed Aug 13, 2014 10:00 am
Posts: 113
Luigi assumed that your GCC installation is not complete because of
Code:
 fatal error: gnu/stubs-32.h: No such file or directory

There is no mention of OpenSSL.

Try
Code:
zypper in glibc-devel-32bit


Top
   
Display posts from previous:  Sort by  
Post new topic  Reply to topic  [ 11 posts ] 

All times are UTC


You cannot post new topics in this forum
You cannot reply to topics in this forum
You cannot edit your posts in this forum
You cannot delete your posts in this forum
You cannot post attachments in this forum

Search for:
Powered by phpBB® Forum Software © phpBB Limited